Target
D(1A) dopamine receptor
Ligand
BDBM84636
Substrate
Meas. Tech.
ChEMBL_488063 (CHEMBL983873)
Ki
699±n/a nM
Citation
 Si, YGGardner, MPTarazi, FIBaldessarini, RJNeumeyer, JL Synthesis and binding studies of 2-O- and 11-O-substituted N-alkylnoraporphines. Bioorg Med Chem Lett 18:3971-3 (2008)  
Target
Name:
D(1A) dopamine receptor
Synonyms:
DOPAMINE D1 Dopamine D1 high Dopamine receptor Dopamine1-like Drd1a
Type:
Enzyme Catalytic Domain
Mol. Mass.:
49429.75
Organism:
RAT
Description:
P18901
Residue:
446
  
Inhibitor
Name:
BDBM84636
Synonyms:
CHEMBL27559 | NPA-11-OH-R,(+)
Type:
Small organic molecule
Emp. Form.:
C19H21NO
Mol. Mass.:
279.3761
SMILES:
CCCN1CCc2cccc-3c2[C@H]1Cc1cccc(O)c-31
: