Target
Thyroid hormone receptor alpha
Ligand
BDBM18869
Substrate
Meas. Tech.
ChEMBL_488091 (CHEMBL986573)
EC50
4.5±n/a nM
Citation
 Raval, SRaval, PBandyopadhyay, DSoni, KYevale, DJogiya, DModi, HJoharapurkar, AGandhi, NJain, MRPatel, PR Design and synthesis of novel 3-hydroxy-cyclobut-3-ene-1,2-dione derivatives as thyroid hormone receptor beta (TR-beta) selective ligands. Bioorg Med Chem Lett 18:3919-24 (2008)  
Target
Name:
Thyroid hormone receptor alpha
Synonyms:
C-erbA-alpha EAR7 NR1A1 THA_HUMAN THRA1 Thyroid Hormone Receptor (TR-alpha) Thyroid hormone receptor alpha c-erbA-1
Type:
Receptor
Mol. Mass.:
54818.00
Organism:
Homo sapiens (Human)
Description:
Recombinant hThR was obtained from nuclear extracts from SF9 cells infected with baculovirus vectors encoding for ThRalpha 1.
Residue:
490
  
Inhibitor
Name:
BDBM18869
Synonyms:
2-{3,5-dichloro-4-[4-hydroxy-3-(propan-2-yl)phenoxy]phenyl}acetic acid KB-141
Type:
Small organic molecule
Emp. Form.:
C17H16Cl2O4
Mol. Mass.:
355.213
SMILES:
CC(C)c1cc(Oc2c(Cl)cc(CC(O)=O)cc2Cl)ccc1O
: