Target
Type-1 angiotensin II receptor A
Ligand
BDBM50049189
Substrate
Meas. Tech.
ChEMBL_488660 (CHEMBL988350)
Ki
1.1±n/a nM
Citation
 Wallinder, CBotros, MRosenström, UGuimond, MOBeaudry, HNyberg, FGallo-Payet, NHallberg, AAlterman, M Selective angiotensin II AT2 receptor agonists: Benzamide structure-activity relationships. Bioorg Med Chem 16:6841-9 (2008)  
Target
Name:
Type-1 angiotensin II receptor A
Synonyms:
AGTRA_RAT Agtr1 Angiotensin II AT1 Angiotensin II receptor (AT-1) type-1 Type-1A angiotensin II receptor
Type:
Enzyme Catalytic Domain
Mol. Mass.:
40910.53
Organism:
RAT
Description:
ANGIOTENSIN AT1 AGTR1 RAT::P25095
Residue:
359
  
Inhibitor
Name:
BDBM50049189
Synonyms:
3-[4-(2-Ethyl-57-dimethyl-imidazo[45-b]pyridin-3-ylmethyl)-phenyl]-5-isobutyl-thiophene-2-sulfonic acid butyloxycarbonylamide(L-162313) L-162313 | butyl 3-(4-((2-ethyl-5,7-dimethyl-3H-imidazo[4,5-b]pyridin-3-yl)methyl)phenyl)-5-isobutylthiophen-2-ylsulfonylcarbamate
Type:
Small organic molecule
Emp. Form.:
C30H38N4O4S2
Mol. Mass.:
582.777
SMILES:
CCCCOC(=O)NS(=O)(=O)c1sc(CC(C)C)cc1-c1ccc(Cn2c(CC)nc3c(C)cc(C)nc23)cc1
: