Target
Type-1 angiotensin II receptor
Ligand
BDBM50251537
Substrate
Meas. Tech.
ChEMBL_488661 (CHEMBL988351)
Ki
3.2±n/a nM
Citation
 Wallinder, CBotros, MRosenström, UGuimond, MOBeaudry, HNyberg, FGallo-Payet, NHallberg, AAlterman, M Selective angiotensin II AT2 receptor agonists: Benzamide structure-activity relationships. Bioorg Med Chem 16:6841-9 (2008)  
Target
Name:
Type-1 angiotensin II receptor
Synonyms:
AGTR1 | AGTR1_PIG
Type:
PROTEIN
Mol. Mass.:
40925.99
Organism:
Sus scrofa
Description:
ChEMBL_488661
Residue:
359
  
Inhibitor
Name:
BDBM50251537
Synonyms:
CHEMBL479399 | butyl 5-isobutyl-3-(4-(piperidine-1-carbonyl)phenyl)thiophen-2-ylsulfonylcarbamate
Type:
Small organic molecule
Emp. Form.:
C25H34N2O5S2
Mol. Mass.:
506.678
SMILES:
CCCCOC(=O)NS(=O)(=O)c1sc(CC(C)C)cc1-c1ccc(cc1)C(=O)N1CCCCC1
: