Target
Cholecystokinin receptor type A
Ligand
BDBM50263227
Substrate
Meas. Tech.
ChEMBL_490133 (CHEMBL994438)
EC50
0.053±n/a nM
Citation
 Zhu, CHansen, ARBateman, TChen, ZHolt, TGHubert, JAKaranam, BVLee, SJPan, JQian, SReddy, VBReitman, MLStrack, AMTong, VWeingarth, DTWolff, MSMacNeil, DJWeber, AEDuffy, JLEdmondson, SD Discovery of imidazole carboxamides as potent and selective CCK1R agonists. Bioorg Med Chem Lett 18:4393-6 (2008)  
Target
Name:
Cholecystokinin receptor type A
Synonyms:
CCK-A receptor CCK1-R CCKAR_HUMAN Cholecystokinin receptor Cholecystokinin-1 Receptor
Type:
G Protein-Coupled Receptor (GPCR)
Mol. Mass.:
47859.34
Organism:
Homo sapiens (Human)
Description:
Stable expression of human CCK-1 receptors in HEK 293 cells.
Residue:
428
  
Inhibitor
Name:
BDBM50263227
Synonyms:
3-(4-(2-(2,4-difluorophenyl)-1-(3-ethoxyphenyl)-1H-imidazole-4-carbonyl)piperazin-1-yl)-1-naphthoic acid | CHEMBL510690
Type:
Small organic molecule
Emp. Form.:
C33H28F2N4O4
Mol. Mass.:
582.5966
SMILES:
CCOc1cccc(c1)-n1cc(nc1-c1ccc(F)cc1F)C(=O)N1CCN(CC1)c1cc(C(O)=O)c2ccccc2c1
: