Target
Gastrin/cholecystokinin type B receptor
Ligand
BDBM50263229
Substrate
Meas. Tech.
ChEMBL_489766 (CHEMBL989249)
EC50
0.14±n/a nM
Citation
 Zhu, CHansen, ARBateman, TChen, ZHolt, TGHubert, JAKaranam, BVLee, SJPan, JQian, SReddy, VBReitman, MLStrack, AMTong, VWeingarth, DTWolff, MSMacNeil, DJWeber, AEDuffy, JLEdmondson, SD Discovery of imidazole carboxamides as potent and selective CCK1R agonists. Bioorg Med Chem Lett 18:4393-6 (2008)  
Target
Name:
Gastrin/cholecystokinin type B receptor
Synonyms:
Cckbr Cholecystokinin receptor Gastrin/cholecystokinin type B receptor
Type:
Enzyme Catalytic Domain
Mol. Mass.:
49196.59
Organism:
MOUSE
Description:
Cholecystokinin A CCKBR MOUSE::P56481
Residue:
453
  
Inhibitor
Name:
BDBM50263229
Synonyms:
3-(4-(1-(2,3-dihydrobenzo[b][1,4]dioxin-6-yl)-2-(4-fluorophenyl)-1H-imidazole-4-carbonyl)piperazin-1-yl)-1-naphthoic acid CHEMBL505969
Type:
Small organic molecule
Emp. Form.:
C33H27FN4O5
Mol. Mass.:
578.5897
SMILES:
OC(=O)c1cc(cc2ccccc12)N1CCN(CC1)C(=O)c1cn(c(n1)-c1ccc(F)cc1)-c1ccc2OCCOc2c1
: