Target
Sterol O-acyltransferase 1
Ligand
BDBM50263194
Substrate
Meas. Tech.
ChEMBL_490663 (CHEMBL988266)
IC50
>10000±n/a nM
Citation
 Takahashi, KKasai, MOhta, MShoji, YKunishiro, KKanda, MKurahashi, KShirahase, H Novel indoline-based acyl-CoA:cholesterol acyltransferase inhibitor with antiperoxidative activity: improvement of physicochemical properties and biological activities by introduction of carboxylic acid. J Med Chem 51:4823-33 (2008)  
Target
Name:
Sterol O-acyltransferase 1
Synonyms:
ACACT ACAT Acetyl-CoA acetyltransferase, mitochondrial Acyl-CoA: cholesterol acyltransferase (ACAT) Cholesterol acyltransferase 1 SOAT1 STAT
Type:
Multi-pass membrane protein may form homo- or heterodimers.
Mol. Mass.:
64751.94
Organism:
Homo sapiens (Human)
Description:
P35610
Residue:
550
  
Inhibitor
Name:
BDBM50263194
Synonyms:
10-[7-(2,2-Dimethylpropanamido)-4,6-dimethylindolin-1-yl]decanoic Acid | CHEMBL517827
Type:
Small organic molecule
Emp. Form.:
C25H40N2O3
Mol. Mass.:
416.5967
SMILES:
Cc1cc(C)c(NC(=O)C(C)(C)C)c2N(CCCCCCCCCC(O)=O)CCc12
: