Target
Sterol O-acyltransferase 1
Ligand
BDBM50263193
Substrate
Meas. Tech.
ChEMBL_490663 (CHEMBL988266)
IC50
3600±n/a nM
Citation
 Takahashi, KKasai, MOhta, MShoji, YKunishiro, KKanda, MKurahashi, KShirahase, H Novel indoline-based acyl-CoA:cholesterol acyltransferase inhibitor with antiperoxidative activity: improvement of physicochemical properties and biological activities by introduction of carboxylic acid. J Med Chem 51:4823-33 (2008)  
Target
Name:
Sterol O-acyltransferase 1
Synonyms:
ACACT ACAT Acetyl-CoA acetyltransferase, mitochondrial Acyl-CoA: cholesterol acyltransferase (ACAT) Cholesterol acyltransferase 1 SOAT1 STAT
Type:
Multi-pass membrane protein may form homo- or heterodimers.
Mol. Mass.:
64751.94
Organism:
Homo sapiens (Human)
Description:
P35610
Residue:
550
  
Inhibitor
Name:
BDBM50263193
Synonyms:
3-[4,6-Dimethyl-7-(2,2-dimethylpropanamido)-1-octylindolin-3-yl]propionic Acid | CHEMBL479062
Type:
Small organic molecule
Emp. Form.:
C26H42N2O3
Mol. Mass.:
430.6233
SMILES:
CCCCCCCCN1CC(CCC(O)=O)c2c1c(NC(=O)C(C)(C)C)c(C)cc2C
: