Target
Cytochrome P450 3A4
Ligand
BDBM50261877
Substrate
Meas. Tech.
ChEMBL_490925 (CHEMBL990018)
IC50
12000±n/a nM
Citation
 Sweeney, ZKAcharya, SBriggs, ADunn, JPElworthy, TRFretland, JGiannetti, AMHeilek, GLi, YKaiser, ACMartin, MSaito, YDSmith, MSuh, JMSwallow, SWu, JHang, JQZhou, ASKlumpp, K Discovery of triazolinone non-nucleoside inhibitors of HIV reverse transcriptase. Bioorg Med Chem Lett 18:4348-51 (2008)  
Target
Name:
Cytochrome P450 3A4
Synonyms:
Albendazole monooxygenase CP3A4_HUMAN CYP3A4 CYPIIIA4 Cytochrome P450 3A4 (CYP3A4) Nifedipine oxidase Taurochenodeoxycholate 6-alpha-hydroxylase
Type:
Enzyme
Mol. Mass.:
57349.57
Organism:
Homo sapiens (Human)
Description:
Residue:
503
  
Inhibitor
Name:
BDBM50261877
Synonyms:
3-chloro-5-(2-fluoro-6-methyl-3-((4-methyl-5-oxo-4,5-dihydro-1H-1,2,4-triazol-3-yl)methyl)phenoxy)benzonitrile | CHEMBL513510
Type:
Small organic molecule
Emp. Form.:
C18H14ClFN4O2
Mol. Mass.:
372.781
SMILES:
Cc1ccc(Cc2n[nH]c(=O)n2C)c(F)c1Oc1cc(Cl)cc(c1)C#N
: