Target
DNA ligase 1
Ligand
BDBM50261994
Substrate
Meas. Tech.
ChEMBL_514273 (CHEMBL979103)
IC50
13000±n/a nM
Citation
 Zhong, SChen, XZhu, XDziegielewska, BBachman, KEEllenberger, TBallin, JDWilson, GMTomkinson, AEMacKerell, AD Identification and validation of human DNA ligase inhibitors using computer-aided drug design. J Med Chem 51:4553-62 (2008)  
Target
Name:
DNA ligase 1
Synonyms:
ATP-dependent DNA ligase DNLI1_HUMAN LIG1 | Polydeoxyribonucleotide synthase [ATP]
Type:
Enzyme
Mol. Mass.:
101721.76
Organism:
Homo sapiens (Human)
Description:
Residue:
919
  
Inhibitor
Name:
BDBM50261994
Synonyms:
2-(7-chloro-4-nitrobenzo[c][1,2,5]oxadiazol-5-ylthio)acetic acid | CHEMBL444491
Type:
Small organic molecule
Emp. Form.:
C8H4ClN3O5S
Mol. Mass.:
289.652
SMILES:
OC(=O)CSc1cc(Cl)c2nonc2c1[N+]([O-])=O
: