Target
Neuropeptide Y receptor type 5
Ligand
BDBM50261898
Substrate
Meas. Tech.
ChEMBL_509554 (CHEMBL997868)
Ki
34±n/a nM
Citation
 Sato, NJitsuoka, MShibata, THirohashi, TNonoshita, KMoriya, MHaga, YSakuraba, AAndo, MOhe, TIwaasa, HGomori, AIshihara, AKanatani, AFukami, T (9S)-9-(2-hydroxy-4,4-dimethyl-6-oxo-1-cyclohexen-1-yl)-3,3-dimethyl-2,3,4,9-tetrahydro-1H-xanthen-1-one, a selective and orally active neuropeptide Y Y5 receptor antagonist. J Med Chem 51:4765-70 (2008)  
Target
Name:
Neuropeptide Y receptor type 5
Synonyms:
NPY-Y5 NPY5-R NPY5R_HUMAN NPYY5 Neuropeptide Y receptor type 5 ( NPY Y5) | Y5 receptor
Type:
Enzyme
Mol. Mass.:
50746.64
Organism:
Homo sapiens (Human)
Description:
Q15761
Residue:
445
  
Inhibitor
Name:
BDBM50261898
Synonyms:
5-Fluoro-9-(2-hydroxy-4,4-dimethyl-6-oxocyclohexyl)-3,3-dimethyl-2,3,4,9-tetrahydro-1H-xanthen-1-one | CHEMBL468225
Type:
Small organic molecule
Emp. Form.:
C23H25FO4
Mol. Mass.:
384.4406
SMILES:
CC1(C)CC(=O)C(C2C3=C(CC(C)(C)CC3=O)Oc3c(F)cccc23)C(=O)C1
: