Target
Cytochrome P450 2D6
Ligand
BDBM50224198
Substrate
Meas. Tech.
ChEMBL_514340 (CHEMBL967954)
Ki
840±n/a nM
Citation
 Shishido, YWakabayashi, HKoike, HUeno, NNukui, SYamagishi, TMurata, YNaganeo, FMizutani, MShimada, KFujiwara, YSakakibara, ASuga, OKusano, RUeda, SKanai, YTsuchiya, MSatake, K Discovery and stereoselective synthesis of the novel isochroman neurokinin-1 receptor antagonist 'CJ-17,493'. Bioorg Med Chem 16:7193-205 (2008)  
Target
Name:
Cytochrome P450 2D6
Synonyms:
CP2D6_HUMAN CYP2DL1 Cytochrome P450 2D6 (CYP2D6) P450-DB1
Type:
Protein
Mol. Mass.:
55774.82
Organism:
Homo sapiens (Human)
Description:
P10635
Residue:
497
  
Inhibitor
Name:
BDBM50224198
Synonyms:
(2S,3S)-N-(2-methoxy-5-(1,1,1-trifluoro-2-methylpropan-2-yl)benzyl)-2-phenylpiperidin-3-amine CHEMBL392368
Type:
Small organic molecule
Emp. Form.:
C23H29F3N2O
Mol. Mass.:
406.4844
SMILES:
COc1ccc(cc1CN[C@H]1CCCN[C@H]1c1ccccc1)C(C)(C)C(F)(F)F
: