Target
Polyamine deacetylase HDAC10
Ligand
BDBM50261816
Substrate
Meas. Tech.
ChEMBL_514674 (CHEMBL976446)
IC50
90.7±n/a nM
Citation
 Kozikowski, APTapadar, SLuchini, DNKim, KHBilladeau, DD Use of the nitrile oxide cycloaddition (NOC) reaction for molecular probe generation: a new class of enzyme selective histone deacetylase inhibitors (HDACIs) showing picomolar activity at HDAC6. J Med Chem 51:4370-3 (2008)  
Target
Name:
Polyamine deacetylase HDAC10
Synonyms:
HD10 HDAC10 Histone deacetylase 10 | Human HDAC10
Type:
Chromatin regulator; hydrolase; repressor
Mol. Mass.:
71431.89
Organism:
Homo sapiens (Human)
Description:
Q969S8
Residue:
669
  
Inhibitor
Name:
BDBM50261816
Synonyms:
CHEMBL511749 | tert-butyl 4-(3-((7-(hydroxyamino)-7-oxoheptyl)carbamoyl)isoxazol-5-yl)phenylcarbamate
Type:
Small organic molecule
Emp. Form.:
C22H30N4O6
Mol. Mass.:
446.4968
SMILES:
CC(C)(C)OC(=O)Nc1ccc(cc1)-c1cc(no1)C(=O)NCCCCCCC(=O)NO
: