Target
Fructose-1,6-bisphosphatase 1
Ligand
BDBM50273273
Substrate
Meas. Tech.
ChEMBL_513687 (CHEMBL974537)
IC50
177856±n/a nM
Citation
 Hebeisen, PKuhn, BKohler, PGubler, MHuber, WKitas, ESchott, BBenz, JJoseph, CRuf, A Allosteric FBPase inhibitors gain 10(5) times in potency when simultaneously binding two neighboring AMP sites. Bioorg Med Chem Lett 18:4708-12 (2008)  
Target
Name:
Fructose-1,6-bisphosphatase 1
Synonyms:
D-fructose-1,6-bisphosphate 1-phosphohydrolase 1 FBP FBPase 1 Fructose-1,6-bisphosphatase 1 | Fructose-1,6-bisphosphatase 1 (FBPase)
Type:
Protein
Mol. Mass.:
36843.58
Organism:
Homo sapiens (Human)
Description:
Liver FBPase (P09467)
Residue:
338
  
Inhibitor
Name:
BDBM50273273
Synonyms:
1-butyl-3-(m-tolylsulfonyl)urea | CHEMBL459134
Type:
Small organic molecule
Emp. Form.:
C12H18N2O3S
Mol. Mass.:
270.348
SMILES:
CCCCNC(=O)NS(=O)(=O)c1cccc(C)c1
: