Target
Cathepsin K
Ligand
BDBM50273216
Substrate
Meas. Tech.
ChEMBL_509760 (CHEMBL997029)
IC50
130±n/a nM
Citation
 Irie, OYokokawa, FEhara, TIwasaki, AIwaki, YHitomi, YKonishi, KKishida, MToyao, AMasuya, KGunji, HSakaki, JIwasaki, GHirao, HKanazawa, TTanabe, KKosaka, THart, TWHallett, A 4-Amino-2-cyanopyrimidines: novel scaffold for nonpeptidic cathepsin S inhibitors. Bioorg Med Chem Lett 18:4642-6 (2008)  
Target
Name:
Cathepsin K
Synonyms:
CATK_HUMAN CTSO Cathepsin O Cathepsin X
Type:
Enzyme
Mol. Mass.:
36975.68
Organism:
Homo sapiens (Human)
Description:
P43235
Residue:
329
  
Inhibitor
Name:
BDBM50273216
Synonyms:
2-cyano-4-((4,4-difluorocyclohexyl)methylamino)-N-phenethylpyrimidine-5-carboxamide | CHEMBL456755
Type:
Small organic molecule
Emp. Form.:
C21H23F2N5O
Mol. Mass.:
399.437
SMILES:
FC1(F)CCC(CNc2nc(ncc2C(=O)NCCc2ccccc2)C#N)CC1
: