Target
Procathepsin L
Ligand
BDBM50273286
Substrate
Meas. Tech.
ChEMBL_509761 (CHEMBL997030)
IC50
700±n/a nM
Citation
 Irie, OYokokawa, FEhara, TIwasaki, AIwaki, YHitomi, YKonishi, KKishida, MToyao, AMasuya, KGunji, HSakaki, JIwasaki, GHirao, HKanazawa, TTanabe, KKosaka, THart, TWHallett, A 4-Amino-2-cyanopyrimidines: novel scaffold for nonpeptidic cathepsin S inhibitors. Bioorg Med Chem Lett 18:4642-6 (2008)  
Target
Name:
Procathepsin L
Synonyms:
CATL1_HUMAN CTSL CTSL1 Cathepsin L Cathepsin L1 heavy chain MEP cathepsin L preproprotein
Type:
Enzyme
Mol. Mass.:
37557.19
Organism:
Homo sapiens (Human)
Description:
Purchased from Calbiochem (San Diego, CA).
Residue:
333
  
Inhibitor
Name:
BDBM50273286
Synonyms:
2-Cyano-4-[(spiro[2.5]oct-6-ylmethyl)-amino]-pyrimidine-5-carboxylic acid (1-methyl-4-phenyl-piperidin-4-ylmethyl)-amide | CHEMBL508319
Type:
Small organic molecule
Emp. Form.:
C28H36N6O
Mol. Mass.:
472.625
SMILES:
CN1CCC(CNC(=O)c2cnc(nc2NCC2CCC3(CC3)CC2)C#N)(CC1)c1ccccc1
: