Target
Cathepsin K
Ligand
BDBM50273286
Substrate
Meas. Tech.
ChEMBL_509760 (CHEMBL997029)
IC50
170±n/a nM
Citation
 Irie, OYokokawa, FEhara, TIwasaki, AIwaki, YHitomi, YKonishi, KKishida, MToyao, AMasuya, KGunji, HSakaki, JIwasaki, GHirao, HKanazawa, TTanabe, KKosaka, THart, TWHallett, A 4-Amino-2-cyanopyrimidines: novel scaffold for nonpeptidic cathepsin S inhibitors. Bioorg Med Chem Lett 18:4642-6 (2008)  
Target
Name:
Cathepsin K
Synonyms:
CATK_HUMAN CTSO Cathepsin O Cathepsin X
Type:
Enzyme
Mol. Mass.:
36975.68
Organism:
Homo sapiens (Human)
Description:
P43235
Residue:
329
  
Inhibitor
Name:
BDBM50273286
Synonyms:
2-Cyano-4-[(spiro[2.5]oct-6-ylmethyl)-amino]-pyrimidine-5-carboxylic acid (1-methyl-4-phenyl-piperidin-4-ylmethyl)-amide | CHEMBL508319
Type:
Small organic molecule
Emp. Form.:
C28H36N6O
Mol. Mass.:
472.625
SMILES:
CN1CCC(CNC(=O)c2cnc(nc2NCC2CCC3(CC3)CC2)C#N)(CC1)c1ccccc1
: