Target
Cathepsin S
Ligand
BDBM50273219
Substrate
Meas. Tech.
ChEMBL_509759 (CHEMBL997028)
IC50
24±n/a nM
Citation
 Irie, OYokokawa, FEhara, TIwasaki, AIwaki, YHitomi, YKonishi, KKishida, MToyao, AMasuya, KGunji, HSakaki, JIwasaki, GHirao, HKanazawa, TTanabe, KKosaka, THart, TWHallett, A 4-Amino-2-cyanopyrimidines: novel scaffold for nonpeptidic cathepsin S inhibitors. Bioorg Med Chem Lett 18:4642-6 (2008)  
Target
Name:
Cathepsin S
Synonyms:
CATS_HUMAN Cathepsin S (Cat S) | cathepsin S preproprotein
Type:
Protein
Mol. Mass.:
37507.38
Organism:
Homo sapiens (Human)
Description:
P25774
Residue:
331
  
Inhibitor
Name:
BDBM50273219
Synonyms:
2-Cyano-4-[(spiro[2.5]oct-6-ylmethyl)-amino]-pyrimidine-5-carboxylic acid (4,5-dimethoxy-biphenyl-2-yl)-amide | CHEMBL456757
Type:
Small organic molecule
Emp. Form.:
C29H31N5O3
Mol. Mass.:
497.5881
SMILES:
COc1cc(NC(=O)c2cnc(nc2NCC2CCC3(CC3)CC2)C#N)c(cc1OC)-c1ccccc1
: