Target
Isoform 1 of Calcitonin receptor (1)
Ligand
BDBM50268484
Substrate
Meas. Tech.
ChEMBL_509836 (CHEMBL1000517)
Ki
>5000±n/a nM
Citation
 Degnan, APChaturvedula, PVConway, CMCook, DADavis, CDDenton, RHan, XMacci, RMathias, NRMoench, PPin, SSRen, SXSchartman, RSignor, LJThalody, GWidmann, KAXu, CMacor, JEDubowchik, GM Discovery of (R)-4-(8-fluoro-2-oxo-1,2-dihydroquinazolin-3(4H)-yl)-N-(3-(7-methyl-1H-indazol-5-yl)-1-oxo-1-(4-(piperidin-1-yl)piperidin-1-yl)propan-2-yl)piperidine-1-carboxamide (BMS-694153): a potent antagonist of the human calcitonin gene-related peptide receptor for migraine with rapid and effic J Med Chem 51:4858-61 (2008)  
Target
Name:
Isoform 1 of Calcitonin receptor (1)
Synonyms:
CALCR CT-R Calcitonin receptor (1)
Type:
PROTEIN
Mol. Mass.:
55343.05
Organism:
Homo sapiens (Human)
Description:
ChEMBL_42610
Residue:
474
  
Inhibitor
Name:
BDBM50268484
Synonyms:
(R)-4-(8-Fluoro-2-oxo-1,2-dihydroquinazolin-3(4H)-yl)-N-(3-(7-methyl-1H-indazol-5-yl)-1-oxo-1-(4-(piperidin-1-yl)piperidin-1-yl)propan-2-yl)piperidine-1-carboxamide BMS-694153 | CHEMBL450668
Type:
Small organic molecule
Emp. Form.:
C35H45FN8O3
Mol. Mass.:
644.782
SMILES:
Cc1cc(C[C@@H](NC(=O)N2CCC(CC2)N2Cc3cccc(F)c3NC2=O)C(=O)N2CCC(CC2)N2CCCCC2)cc2cn[nH]c12
: