Target
Cytoplasmic tyrosine-protein kinase BMX
Ligand
BDBM4567
Substrate
Meas. Tech.
ChEMBL_540169 (CHEMBL1026517)
IC50
303±n/a nM
Citation
 Hur, WVelentza, AKim, SFlatauer, LJiang, XValente, DMason, DESuzuki, MLarson, BZhang, JZagorska, ADidonato, MNagle, AWarmuth, MBalk, SPPeters, ECGray, NS Clinical stage EGFR inhibitors irreversibly alkylate Bmx kinase. Bioorg Med Chem Lett 18:5916-9 (2008)  
Target
Name:
Cytoplasmic tyrosine-protein kinase BMX
Synonyms:
BMX BMX_HUMAN Cytoplasmic tyrosine-protein kinase BMX (BMX) Epithelial and endothelial tyrosine kinase Tyrosine Kinase BMX | Tyrosine-protein kinase BMX/ETK
Type:
Tyrosine-protein kinase
Mol. Mass.:
78030.42
Organism:
Homo sapiens (Human)
Description:
P51813
Residue:
675
  
Inhibitor
Name:
BDBM4567
Synonyms:
4-anilinoquinazoline deriv. 2 CHEMBL285063 US9422297, PD168393
Type:
Small organic molecule
Emp. Form.:
C17H13BrN4O
Mol. Mass.:
369.215
SMILES:
Brc1cccc(Nc2ncnc3ccc(NC(=O)C=C)cc23)c1
: