Target
B1 bradykinin receptor
Ligand
BDBM50272447
Substrate
Meas. Tech.
ChEMBL_510231 (CHEMBL1005609)
Ki
1.2±n/a nM
Citation
 Chen, JJQian, WBiswas, KViswanadhan, VNAskew, BCHitchcock, SHungate, RWArik, LJohnson, E Discovery of dihydroquinoxalinone acetamides containing bicyclic amines as potent Bradykinin B1 receptor antagonists. Bioorg Med Chem Lett 18:4477-81 (2008)  
Target
Name:
B1 bradykinin receptor
Synonyms:
B1 BRADYKININ B1R BK-1 receptor BRADYB1 | Bradykinin B1 receptor
Type:
Enzyme
Mol. Mass.:
40508.87
Organism:
Homo sapiens (Human)
Description:
P46663
Residue:
353
  
Inhibitor
Name:
BDBM50272447
Synonyms:
2-((R)-1-(3,4-dichlorophenylsulfonyl)-3-oxo-1,2,3,4-tetrahydroquinoxalin-2-yl)-N-((R)-7-((methylamino)methyl)chroman-4-yl)acetamide | CHEMBL503847
Type:
Small organic molecule
Emp. Form.:
C27H26Cl2N4O5S
Mol. Mass.:
589.49
SMILES:
CNCc1ccc2[C@@H](CCOc2c1)NC(=O)C[C@H]1N(c2ccccc2NC1=O)S(=O)(=O)c1ccc(Cl)c(Cl)c1
: