Target
Receptor tyrosine-protein kinase erbB-2
Ligand
BDBM50245472
Substrate
Meas. Tech.
ChEMBL_512832 (CHEMBL971643)
IC50
80±n/a nM
Citation
 Hughes, TVXu, GWetter, SKConnolly, PJEmanuel, SLKarnachi, PPollack, SRPandey, NAdams, MMoreno-Mazza, SMiddleton, SAGreenberger, LM A novel 5-[1,3,4-oxadiazol-2-yl]-N-aryl-4,6-pyrimidine diamine having dual EGFR/HER2 kinase activity: design, synthesis, and biological activity. Bioorg Med Chem Lett 18:4896-9 (2008)  
Target
Name:
Receptor tyrosine-protein kinase erbB-2
Synonyms:
2.7.10.1 CD_antigen=CD340 ERBB2_HUMAN FASN/HER2 HER2 MLN19 NEU Proto-oncogene Neu Tyrosine kinase-type cell surface receptor HER2 | p185erbB2
Type:
Mol. Mass.:
137894.47
Organism:
Homo sapiens (Human)
Description:
P04626
Residue:
1255
  
Inhibitor
Name:
BDBM50245472
Synonyms:
CHEMBL472545 | N-(4-Benzyloxy-3-chloro-phenyl)-5-[5-(2-morpholin-4-yl-ethyl)-[1,3,4]oxadiazol-2-yl]-pyrimidine-4,6-diamine
Type:
Small organic molecule
Emp. Form.:
C25H26ClN7O3
Mol. Mass.:
507.972
SMILES:
Nc1ncnc(Nc2ccc(OCc3ccccc3)c(Cl)c2)c1-c1nnc(CCN2CCOCC2)o1
: