Target
Cholinesterase
Ligand
BDBM50272489
Substrate
Meas. Tech.
ChEMBL_510557 (CHEMBL998780)
IC50
800±n/a nM
Citation
 Devkota, KPLenta, BNWansi, JDChoudhary, MIKisangau, DPNaz, QSamreen, naSewald, N Bioactive 5alpha-pregnane-type steroidal alkaloids from Sarcococca hookeriana. J Nat Prod 71:1481-4 (2008)  
Target
Name:
Cholinesterase
Synonyms:
Acylcholine acylhydrolase Butyrylcholine esterase (BChE) Butyrylcholinesterase (BuChE) CHLE_HUMAN Cholinesterases Pseudocholinesterase
Type:
Homotetramer
Mol. Mass.:
68422.27
Organism:
Homo sapiens (Human)
Description:
P06276
Residue:
602
  
Inhibitor
Name:
BDBM50272489
Synonyms:
(20S)-20-(N,N-dimethylamino)-3beta-(N-senecoylamino)-5alpha-pregn-16-en-4beta-ol | CHEMBL496487
Type:
Small organic molecule
Emp. Form.:
C28H46N2O2
Mol. Mass.:
442.677
SMILES:
[#6]-[#6@H](-[#7](-[#6])-[#6])-[#6]1=[#6]-[#6]-[#6@H]2-[#6@@H]-3-[#6]-[#6]-[#6@H]4-[#6@@H](-[#8])-[#6@H](-[#6]-[#6][C@]4([#6])[#6@H]-3-[#6]-[#6][C@]12[#6])-[#7]-[#6](=O)\[#6]=[#6](\[#6])-[#6]
: