Target
Aurora kinase B
Ligand
BDBM50245420
Substrate
Meas. Tech.
ChEMBL_513147 (CHEMBL973636)
IC50
45±n/a nM
Citation
 Bauer, DWhittington, DACoxon, ABready, JHarriman, SPPatel, VFPolverino, AHarmange, JC Evaluation of indazole-based compounds as a new class of potent KDR/VEGFR-2 inhibitors. Bioorg Med Chem Lett 18:4844-8 (2008)  
Target
Name:
Aurora kinase B
Synonyms:
AIK2 AIM1 ARK2 AURKB_HUMAN Aurora B-INCENP Aurora kinase B (AURKB) STK-1 STK12 Serine/threonine-protein kinase aurora B
Type:
Protein
Mol. Mass.:
39327.72
Organism:
Homo sapiens (Human)
Description:
Q96GD4
Residue:
344
  
Inhibitor
Name:
BDBM50245420
Synonyms:
CHEMBL462168 | N-(6-(6,7-dimethoxyquinolin-4-yloxy)-1-methyl-1H-indazol-3-yl)-3-(trifluoromethyl)benzamide
Type:
Small organic molecule
Emp. Form.:
C27H21F3N4O4
Mol. Mass.:
522.4752
SMILES:
COc1cc2nccc(Oc3ccc4c(NC(=O)c5cccc(c5)C(F)(F)F)nn(C)c4c3)c2cc1OC
: