Target
Vascular endothelial growth factor receptor 2
Ligand
BDBM50245771
Substrate
Meas. Tech.
ChEMBL_513139 (CHEMBL973628)
IC50
2±n/a nM
Citation
 Bauer, DWhittington, DACoxon, ABready, JHarriman, SPPatel, VFPolverino, AHarmange, JC Evaluation of indazole-based compounds as a new class of potent KDR/VEGFR-2 inhibitors. Bioorg Med Chem Lett 18:4844-8 (2008)  
Target
Name:
Vascular endothelial growth factor receptor 2
Synonyms:
CD_antigen=CD309 Fetal liver kinase 1 (FLK-1) KDR Protein-tyrosine kinase receptor Flk-1 VEGFR-2 VEGFR2 Vascular Endothelial Growth Factor Receptor Kinase 2 Vascular endothelial growth factor receptor 2 (KDR) Vascular endothelial growth factor receptor 2 (VEGFR2) Vascular endothelial growth factor receptor-2 (VEGFR-2)
Type:
Receptor Tyrosine Kinase
Mol. Mass.:
151510.97
Organism:
Homo sapiens (Human)
Description:
P35968
Residue:
1356
  
Inhibitor
Name:
BDBM50245771
Synonyms:
1-(6-(6,7-dimethoxyquinolin-4-yloxy)-1-methyl-1H-indazol-3-yl)-3-p-tolylurea | CHEMBL509707
Type:
Small organic molecule
Emp. Form.:
C27H25N5O4
Mol. Mass.:
483.5185
SMILES:
COc1cc2nccc(Oc3ccc4c(NC(=O)Nc5ccc(C)cc5)nn(C)c4c3)c2cc1OC
: