Target
Aurora kinase A
Ligand
BDBM50245420
Substrate
Meas. Tech.
ChEMBL_513149 (CHEMBL973638)
IC50
764±n/a nM
Citation
 Bauer, DWhittington, DACoxon, ABready, JHarriman, SPPatel, VFPolverino, AHarmange, JC Evaluation of indazole-based compounds as a new class of potent KDR/VEGFR-2 inhibitors. Bioorg Med Chem Lett 18:4844-8 (2008)  
Target
Name:
Aurora kinase A
Synonyms:
AIK ARK1 AURKA AYK1 Aurora kinase A (AURA) Aurora kinase A (Aurora A) Aurora-related kinase 1 BTAK Breast-tumor-amplified kinase STK15 Serine/threonine kinase 15 Serine/threonine-protein kinase aurora A hARK1
Type:
Serine/threonine-protein kinase
Mol. Mass.:
45830.98
Organism:
Homo sapiens (Human)
Description:
O14965
Residue:
403
  
Inhibitor
Name:
BDBM50245420
Synonyms:
CHEMBL462168 | N-(6-(6,7-dimethoxyquinolin-4-yloxy)-1-methyl-1H-indazol-3-yl)-3-(trifluoromethyl)benzamide
Type:
Small organic molecule
Emp. Form.:
C27H21F3N4O4
Mol. Mass.:
522.4752
SMILES:
COc1cc2nccc(Oc3ccc4c(NC(=O)c5cccc(c5)C(F)(F)F)nn(C)c4c3)c2cc1OC
: