Target
Tyrosine-protein kinase JAK2
Ligand
BDBM50245420
Substrate
Meas. Tech.
ChEMBL_513154 (CHEMBL973643)
IC50
25000000±n/a nM
Citation
 Bauer, DWhittington, DACoxon, ABready, JHarriman, SPPatel, VFPolverino, AHarmange, JC Evaluation of indazole-based compounds as a new class of potent KDR/VEGFR-2 inhibitors. Bioorg Med Chem Lett 18:4844-8 (2008)  
Target
Name:
Tyrosine-protein kinase JAK2
Synonyms:
JAK-2 JAK2_HUMAN Janus kinase 2 (JAK2) | Janus kinase 2 (a protein tyrosine kinase)
Type:
Protein
Mol. Mass.:
130684.68
Organism:
Homo sapiens (Human)
Description:
O60674
Residue:
1132
  
Inhibitor
Name:
BDBM50245420
Synonyms:
CHEMBL462168 | N-(6-(6,7-dimethoxyquinolin-4-yloxy)-1-methyl-1H-indazol-3-yl)-3-(trifluoromethyl)benzamide
Type:
Small organic molecule
Emp. Form.:
C27H21F3N4O4
Mol. Mass.:
522.4752
SMILES:
COc1cc2nccc(Oc3ccc4c(NC(=O)c5cccc(c5)C(F)(F)F)nn(C)c4c3)c2cc1OC
: