Target
Ras guanyl-releasing protein 3
Ligand
BDBM50244482
Substrate
Meas. Tech.
ChEMBL_512396 (CHEMBL979907)
Ki
3.8±n/a nM
Citation
 Duan, DSigano, DMKelley, JALai, CCLewin, NEKedei, NPeach, MLLee, JAbeyweera, TPRotenberg, SAKim, HKim, YHEl Kazzouli, SChung, JUYoung, HAYoung, MRBaker, AColburn, NHHaimovitz-Friedman, ATruman, JPParrish, DADeschamps, JRPerry, NASurawski, RJBlumberg, PMMarquez, VE Conformationally constrained analogues of diacylglycerol. 29. Cells sort diacylglycerol-lactone chemical zip codes to produce diverse and selective biological activities. J Med Chem 51:5198-220 (2008)  
Target
Name:
Ras guanyl-releasing protein 3
Synonyms:
GRP3 KIAA0846 RASGRP3
Type:
PROTEIN
Mol. Mass.:
78335.20
Organism:
Homo sapiens (Human)
Description:
ChEMBL_1364407
Residue:
690
  
Inhibitor
Name:
BDBM50244482
Synonyms:
(4-(4-nitrobenzylidene)-2-(hydroxymethyl)-5-oxo-tetrahydrofuran-2-yl)methyl 4-(dimethylamino)benzoate rac-(E)-{2-(Hydroxymethyl)-4-[(4-nitrophenyl)methylene]-5-oxo-2-2,3-dihydrofuryl}methyl 4-(Dimethylamino)benzoate
Type:
Small organic molecule
Emp. Form.:
C22H22N2O7
Mol. Mass.:
426.4193
SMILES:
CN(C)c1ccc(cc1)C(=O)OCC1(CO)C\C(=C/c2ccc(cc2)[N+]([O-])=O)C(=O)O1
: