Target
Ras guanyl-releasing protein 3
Ligand
BDBM50244451
Substrate
Meas. Tech.
ChEMBL_513189 (CHEMBL977319)
Ki
0.70±n/a nM
Citation
 El Kazzouli, SLewin, NEBlumberg, PMMarquez, VE Conformationally constrained analogues of diacylglycerol. 30. An investigation of diacylglycerol-lactones containing heteroaryl groups reveals compounds with high selectivity for Ras guanyl nucleotide-releasing proteins. J Med Chem 51:5371-86 (2008)  
Target
Name:
Ras guanyl-releasing protein 3
Synonyms:
GRP3 KIAA0846 RASGRP3
Type:
PROTEIN
Mol. Mass.:
78335.20
Organism:
Homo sapiens (Human)
Description:
ChEMBL_1364407
Residue:
690
  
Inhibitor
Name:
BDBM50244451
Synonyms:
(E)-(2-(hydroxymethyl)-4-((1-methyl-1H-indol-3-yl)methylene)-5-oxo-tetrahydrofuran-2-yl)methyl 2-isobutyl-4-methylpentanoate | CHEMBL488667
Type:
Small organic molecule
Emp. Form.:
C26H35NO5
Mol. Mass.:
441.5598
SMILES:
CC(C)CC(CC(C)C)C(=O)OCC1(CO)C\C(=C/c2cn(C)c3ccccc23)C(=O)O1
: