Target
Transient receptor potential cation channel subfamily V member 1
Ligand
BDBM20466
Substrate
Meas. Tech.
ChEMBL_535191 (CHEMBL990787)
IC50
20200±n/a nM
Citation
 Brown, BSKeddy, RZheng, GZSchmidt, RGKoenig, JRMcDonald, HABianchi, BRHonore, PJarvis, MFSurowy, CSPolakowski, JSMarsh, KCFaltynek, CRLee, CH Tetrahydropyridine-4-carboxamides as novel, potent transient receptor potential vanilloid 1 (TRPV1) antagonists. Bioorg Med Chem 16:8516-25 (2008)  
Target
Name:
Transient receptor potential cation channel subfamily V member 1
Synonyms:
Capsaicin receptor Osm-9-like TRP channel 1 TRPV1_HUMAN Transient receptor potential cation channel subfamily V member 1 (TRPV1) Transient receptor potential cation channel subfamily V member 1(TRPV1) Vanilloid VR1 Vanilloid receptor 1 Vanilloid receptor 1 (VRI/TRPV1)
Type:
Protein
Mol. Mass.:
94960.75
Organism:
Homo sapiens (Human)
Description:
Q8NER1
Residue:
839
  
Inhibitor
Name:
BDBM20466
Synonyms:
A-784168 N-[4-(trifluoromethane)sulfonylphenyl]-1-[3-(trifluoromethyl)pyridin-2-yl]-1,2,3,6-tetrahydropyridine-4-carboxamide
Type:
Small organic molecule
Emp. Form.:
C19H15F6N3O3S
Mol. Mass.:
479.396
SMILES:
FC(F)(F)c1cccnc1N1CCC(=CC1)C(=O)Nc1ccc(cc1)S(=O)(=O)C(F)(F)F
: