Target
Cannabinoid receptor 1
Ligand
BDBM50132717
Substrate
Meas. Tech.
ChEMBL_557789 (CHEMBL953298)
IC50
2±n/a nM
Citation
 Nomura, DKHudak, CSWard, AMBurston, JJIssa, RSFisher, KJAbood, MEWiley, JLLichtman, AHCasida, JE Monoacylglycerol lipase regulates 2-arachidonoylglycerol action and arachidonic acid levels. Bioorg Med Chem Lett 18:5875-8 (2008)  
Target
Name:
Cannabinoid receptor 1
Synonyms:
Brain-type cannabinoid receptor CB-R CNR1_MOUSE Cannabinoid receptor | Cnr1
Type:
Enzyme
Mol. Mass.:
52842.52
Organism:
Mus musculus (Mouse)
Description:
P47746
Residue:
473
  
Inhibitor
Name:
BDBM50132717
Synonyms:
CHEMBL333149 isopropyl dodecylphosphonofluoridate | isopropyl dodecylphosphonofluoridoate
Type:
Small organic molecule
Emp. Form.:
C15H32FO2P
Mol. Mass.:
294.3855
SMILES:
CCCCCCCCCCCCP(F)(=O)OC(C)C
: