Target
Fatty-acid amide hydrolase 1
Ligand
BDBM50247049
Substrate
Meas. Tech.
ChEMBL_557788 (CHEMBL953297)
IC50
42±n/a nM
Citation
 Nomura, DKHudak, CSWard, AMBurston, JJIssa, RSFisher, KJAbood, MEWiley, JLLichtman, AHCasida, JE Monoacylglycerol lipase regulates 2-arachidonoylglycerol action and arachidonic acid levels. Bioorg Med Chem Lett 18:5875-8 (2008)  
Target
Name:
Fatty-acid amide hydrolase 1
Synonyms:
Anandamide amidohydrolase FAAH1_MOUSE Faah1 Fatty-acid amide hydrolase (FAAH) Oleamide hydrolase 1
Type:
Hydrolase; single-pass membrane protein; homodimer
Mol. Mass.:
63227.28
Organism:
Mus musculus (mouse)
Description:
Mouse brain membranes were used in the assay.
Residue:
579
  
Inhibitor
Name:
BDBM50247049
Synonyms:
CHEMBL462610 | ethyl 3,5,6-trichloropyridin-2-yl dodecylphosphonate
Type:
Small organic molecule
Emp. Form.:
C19H31Cl3NO3P
Mol. Mass.:
458.787
SMILES:
CCCCCCCCCCCCP(=O)(OCC)Oc1nc(Cl)c(Cl)cc1Cl
: