Target
Sodium- and chloride-dependent glycine transporter 1
Ligand
BDBM50264734
Substrate
Meas. Tech.
ChEMBL_496465 (CHEMBL1007112)
EC50
16±n/a nM
Citation
 Pinard, EAlberati, DBorroni, EFischer, HHainzl, DJolidon, SMoreau, JLNarquizian, RNettekoven, MNorcross, RDStalder, HThomas, AW Discovery of benzoylpiperazines as a novel class of potent and selective GlyT1 inhibitors. Bioorg Med Chem Lett 18:5134-9 (2008)  
Target
Name:
Sodium- and chloride-dependent glycine transporter 1
Synonyms:
GlyT-1 Glycine Transporters (GlyT1c) SC6A9_HUMAN Sodium- and chloride-dependent glycine transporter 1 Sodium- and chloride-dependent glycine transporter 1 (GlyT1c) Solute carrier family 6 member 9
Type:
Enzyme
Mol. Mass.:
78270.54
Organism:
Homo sapiens (Human)
Description:
P48067
Residue:
706
  
Inhibitor
Name:
BDBM50264734
Synonyms:
1-(3-fluoro-4-(4-(3'-fluoro-4-(methylsulfonyl)biphenylcarbonyl)piperazin-1-yl)phenyl)ethanone | CHEMBL492045
Type:
Small organic molecule
Emp. Form.:
C26H24F2N2O4S
Mol. Mass.:
498.542
SMILES:
CC(=O)c1ccc(N2CCN(CC2)C(=O)c2cc(ccc2-c2cccc(F)c2)S(C)(=O)=O)c(F)c1
: