Target
Telomerase reverse transcriptase
Ligand
BDBM50253730
Substrate
Meas. Tech.
ChEMBL_512488 (CHEMBL966978)
EC50
>40000±n/a nM
Citation
 Zagotto, GSissi, CLucatello, LPivetta, CCadamuro, SAFox, KRNeidle, SPalumbo, M Aminoacyl-anthraquinone conjugates as telomerase inhibitors: synthesis, biophysical and biological evaluation. J Med Chem 51:5566-74 (2008)  
Target
Name:
Telomerase reverse transcriptase
Synonyms:
EST2 TERT TRT
Type:
PROTEIN
Mol. Mass.:
127099.03
Organism:
Homo sapiens (Human)
Description:
ChEMBL_1447029
Residue:
1132
  
Inhibitor
Name:
BDBM50253730
Synonyms:
9,10-Dioxo-9,10-dihydro-anthracene-2,6-dicarboxylic acid bis-{[2-((S)-2-amino-4-methyl-pentanoylamino)-ethyl]-amide} | CHEMBL309071
Type:
Small organic molecule
Emp. Form.:
C32H42N6O6
Mol. Mass.:
606.7125
SMILES:
CC(C)C[C@H](N)C(=O)NCCNC(=O)c1ccc2C(=O)c3cc(ccc3C(=O)c2c1)C(=O)NCCNC(=O)[C@@H](N)CC(C)C
: