Target
D(2) dopamine receptor
Ligand
BDBM50253663
Substrate
Meas. Tech.
ChEMBL_538660 (CHEMBL1033058)
Ki
5.6±n/a nM
Citation
 Paul, NMTaylor, MKumar, RDeschamps, JRLuedtke, RRNewman, AH Structure-activity relationships for a novel series of dopamine D2-like receptor ligands based on N-substituted 3-aryl-8-azabicyclo[3.2.1]octan-3-ol. J Med Chem 51:6095-109 (2008)  
Target
Name:
D(2) dopamine receptor
Synonyms:
D(2) dopamine receptor DOPAMINE D2 Long DRD2 Dopamine D2 receptor Dopamine D2 receptor (D2R) Dopamine2-like | d2
Type:
Cell-surface receptors
Mol. Mass.:
50647.10
Organism:
Homo sapiens (Human)
Description:
P14416
Residue:
443
  
Inhibitor
Name:
BDBM50253663
Synonyms:
CHEMBL461197 | endo-8-(Naphtho[1,2-b]fur-3-ylmethyl)-3-(4-chlorophenyl)-8-azabicyclo[3.2.1]octan-3-ol
Type:
Small organic molecule
Emp. Form.:
C26H24ClNO2
Mol. Mass.:
417.927
SMILES:
OC1(CC2CCC(C1)N2Cc1coc2c1ccc1ccccc21)c1ccc(Cl)cc1
: