Target
Alpha-2B adrenergic receptor
Ligand
BDBM50253754
Substrate
Meas. Tech.
ChEMBL_539627 (CHEMBL1025632)
Ki
7±n/a nM
Citation
 Lazarova, NZoghbi, SSHong, JSeneca, NTuan, EGladding, RLLiow, JSTaku, AInnis, RBPike, VW Synthesis and evaluation of [N-methyl-11C]N-desmethyl-loperamide as a new and improved PET radiotracer for imaging P-gp function. J Med Chem 51:6034-43 (2008)  
Target
Name:
Alpha-2B adrenergic receptor
Synonyms:
ADA2B_HUMAN ADRA2L1 Adrenergic alpha2B Adrenergic receptor alpha Alpha-2 adrenergic receptor subtype C2 Alpha-2B adrenoreceptor | Alpha-2BAR
Type:
Enzyme
Mol. Mass.:
49964.20
Organism:
Homo sapiens (Human)
Description:
P18089
Residue:
450
  
Inhibitor
Name:
BDBM50253754
Synonyms:
4-(4-(4-chlorophenyl)-4-hydroxypiperidin-1-yl)-N-methyl-2,2-diphenylbutanamide | CHEMBL1627
Type:
Small organic molecule
Emp. Form.:
C28H31ClN2O2
Mol. Mass.:
463.011
SMILES:
CNC(=O)C(CCN1CCC(O)(CC1)c1ccc(Cl)cc1)(c1ccccc1)c1ccccc1
: