Target
Cathepsin S
Ligand
BDBM50263510
Substrate
Meas. Tech.
ChEMBL_535680 (CHEMBL988834)
IC50
31±n/a nM
Citation
 Irie, OKosaka, TKishida, MSakaki, JMasuya, KKonishi, KYokokawa, FEhara, TIwasaki, AIwaki, YHitomi, YToyao, AGunji, HTeno, NIwasaki, GHirao, HKanazawa, TTanabe, KHiestand, PCMalcangio, MFox, AJBevan, SJYaqoob, MCulshaw, AJHart, TWHallett, A Overcoming hERG issues for brain-penetrating cathepsin S inhibitors: 2-cyanopyrimidines. Part 2. Bioorg Med Chem Lett 18:5280-4 (2008)  
Target
Name:
Cathepsin S
Synonyms:
CATS_HUMAN Cathepsin S (Cat S) | cathepsin S preproprotein
Type:
Protein
Mol. Mass.:
37507.38
Organism:
Homo sapiens (Human)
Description:
P25774
Residue:
331
  
Inhibitor
Name:
BDBM50263510
Synonyms:
4-(1,4-dioxaspiro[4.5]decan-8-ylmethylamino)-2-cyano-N-methyl-6-((1-methylpiperidin-4-yl)methoxy)pyrimidine-5-carboxamide | CHEMBL513921
Type:
Small organic molecule
Emp. Form.:
C23H34N6O4
Mol. Mass.:
458.5539
SMILES:
CNC(=O)c1c(NCC2CCC3(CC2)OCCO3)nc(nc1OCC1CCN(C)CC1)C#N
: