Target
Neuronal acetylcholine receptor subunit alpha-4
Ligand
BDBM50264764
Substrate
Meas. Tech.
ChEMBL_497109 (CHEMBL998587)
EC50
410±n/a nM
Citation
 Albrecht, BKBerry, VBoezio, AACao, LClarkin, KGuo, WHarmange, JCHierl, MHuang, LJanosky, BKnop, JMalmberg, AMcDermott, JSNguyen, HQSpringer, SKWaldon, DWoodin, KMcDonough, SI Discovery and optimization of substituted piperidines as potent, selective, CNS-penetrant alpha4beta2 nicotinic acetylcholine receptor potentiators. Bioorg Med Chem Lett 18:5209-12 (2008)  
Target
Name:
Neuronal acetylcholine receptor subunit alpha-4
Synonyms:
ACHA4_HUMAN CHRNA4 protein Neuronal acetylcholine receptor protein alpha-4 subunit Nicotinic acetylcholine receptor alpha4/beta2/alpha5
Type:
Mol. Mass.:
69963.49
Organism:
Homo sapiens (Human)
Description:
NACHRA4
Residue:
627
  
Inhibitor
Name:
BDBM50264764
Synonyms:
3-(2,6-dichlorophenyl)-5-(1-(piperidin-4-yl)-1H-pyrazol-4-yl)isoxazole | CHEMBL490819
Type:
Small organic molecule
Emp. Form.:
C17H16Cl2N4O
Mol. Mass.:
363.241
SMILES:
Clc1cccc(Cl)c1-c1cc(on1)-c1cnn(c1)C1CCNCC1
: