Target
Disintegrin and metalloproteinase domain-containing protein 9
Ligand
BDBM50265157
Substrate
Meas. Tech.
ChEMBL_492655 (CHEMBL953084)
IC50
>5000±n/a nM
Citation
 Georgiadis, DYiotakis, A Specific targeting of metzincin family members with small-molecule inhibitors: progress toward a multifarious challenge. Bioorg Med Chem 16:8781-94 (2008)  
Target
Name:
Disintegrin and metalloproteinase domain-containing protein 9
Synonyms:
ADAM9 Disintegrin and metalloproteinase domain-containing protein 9 (ADAM9) MCMP MLTNG
Type:
Enzyme
Mol. Mass.:
90567.68
Organism:
Homo sapiens (Human)
Description:
Q13443
Residue:
819
  
Inhibitor
Name:
BDBM50265157
Synonyms:
(6S,7S)-N-hydroxy-5-methyl-6-(4-(5-(trifluoromethyl)pyridin-2-yl)piperazine-1-carbonyl)-5-azaspiro[2.5]octane-7-carboxamide | CHEMBL497985
Type:
Small organic molecule
Emp. Form.:
C20H26F3N5O3
Mol. Mass.:
441.4473
SMILES:
CN1CC2(CC2)C[C@@H]([C@H]1C(=O)N1CCN(CC1)c1ccc(cn1)C(F)(F)F)C(=O)NO
: