Target
Tyrosine-protein kinase Lck
Ligand
BDBM50263831
Substrate
Meas. Tech.
ChEMBL_536054 (CHEMBL994221)
EC50
14400±n/a nM
Citation
 Kawamura, AHindi, SMihai, DMJames, LAminova, O Binding is not enough: flexibility is needed for photocrosslinking of Lck kinase by benzophenone photoligands. Bioorg Med Chem 16:8824-9 (2008)  
Target
Name:
Tyrosine-protein kinase Lck
Synonyms:
2.7.10.2 LCK_HUMAN Leukocyte C-terminal Src kinase Lymphocyte-specific protein tyrosine kinase Protein YT16 Proto-oncogene tyrosine-protein kinase LCK T cell-specific protein-tyrosine kinase
Type:
Mol. Mass.:
57987.83
Organism:
Homo sapiens (Human)
Description:
P06239
Residue:
509
  
Inhibitor
Name:
BDBM50263831
Synonyms:
(S)-6-(2-(6-amino-9H-purin-9-yl)acetyl)-14-(4-benzoylbenzyl)-4,10,13,16,21-pentaoxo-25-((3aS,4S,6aR)-2-oxohexahydro-1H-thieno[3,4-d]imidazol-4-yl)-3,6,9,12,15,20-hexaazapentacosan-1-oic acid | CHEMBL454005
Type:
Small organic molecule
Emp. Form.:
C45H55N13O10S
Mol. Mass.:
970.064
SMILES:
Nc1ncnc2n(CC(=O)N(CCNC(=O)CNC(=O)[C@H](Cc3ccc(cc3)C(=O)c3ccccc3)NC(=O)CCCNC(=O)CCCC[C@@H]3SC[C@@H]4NC(=O)N[C@H]34)CC(=O)NCC(O)=O)cnc12
: