Target
Mu-type opioid receptor
Ligand
BDBM50252864
Substrate
Meas. Tech.
ChEMBL_534705 (CHEMBL982794)
Ki
1.52±n/a nM
Citation
 Ghosh, ALuo, JLiu, CWeltrowska, GLemieux, CChung, NNLu, YSchiller, PW Novel opioid peptide derived antagonists containing (2S)-2-methyl-3-(2,6-dimethyl-4-carbamoylphenyl)propanoic acid [(2S)-Mdcp]. J Med Chem 51:5866-70 (2008)  
Target
Name:
Mu-type opioid receptor
Synonyms:
M-OR-1 Mu opioid receptor OPIATE Mu OPRM_CAVPO
Type:
Enzyme Catalytic Domain
Mol. Mass.:
11165.58
Organism:
GUINEA PIG
Description:
P97266
Residue:
98
  
Inhibitor
Name:
BDBM50252864
Synonyms:
CHEMBL454035 | antanal 2
Type:
Small organic molecule
Emp. Form.:
C38H43N5O5
Mol. Mass.:
649.7785
SMILES:
Cc1cc(O)cc(C)c1C[C@H](N)C(=O)N1CCC[C@@H]1C(=O)N[C@@H](Cc1ccccc1)C(=O)N[C@H](Cc1ccc2ccccc2c1)C(N)=O
: