Target
Muscarinic acetylcholine receptor M5
Ligand
BDBM50263937
Substrate
Meas. Tech.
ChEMBL_536132 (CHEMBL983586)
EC50
>50000±n/a nM
Citation
 Bridges, TMBrady, AEKennedy, JPDaniels, RNMiller, NRKim, KBreininger, MLGentry, PRBrogan, JTJones, CKConn, PJLindsley, CW Synthesis and SAR of analogues of the M1 allosteric agonist TBPB. Part I: Exploration of alternative benzyl and privileged structure moieties. Bioorg Med Chem Lett 18:5439-42 (2008)  
Target
Name:
Muscarinic acetylcholine receptor M5
Synonyms:
ACM5_HUMAN | CHRM5
Type:
PROTEIN
Mol. Mass.:
60102.35
Organism:
Homo sapiens (Human)
Description:
ChEMBL_1517990
Residue:
532
  
Inhibitor
Name:
BDBM50263937
Synonyms:
6-Fluoro-1-[1'-(2-trifluoromethyl-benzyl)-[1,4']bipiperidinyl-4-yl]-1,3-dihydro-benzoimidazol-2-one | CHEMBL491818
Type:
Small organic molecule
Emp. Form.:
C25H28F4N4O
Mol. Mass.:
476.5096
SMILES:
Fc1ccc2[nH]c(=O)n(C3CCN(CC3)C3CCN(Cc4ccccc4C(F)(F)F)CC3)c2c1
: