Target
Muscarinic acetylcholine receptor M1
Ligand
BDBM50263413
Substrate
Meas. Tech.
ChEMBL_536125 (CHEMBL983579)
EC50
490±n/a nM
Citation
 Bridges, TMBrady, AEKennedy, JPDaniels, RNMiller, NRKim, KBreininger, MLGentry, PRBrogan, JTJones, CKConn, PJLindsley, CW Synthesis and SAR of analogues of the M1 allosteric agonist TBPB. Part I: Exploration of alternative benzyl and privileged structure moieties. Bioorg Med Chem Lett 18:5439-42 (2008)  
Target
Name:
Muscarinic acetylcholine receptor M1
Synonyms:
ACM1_HUMAN Cholinergic receptor, muscarinic 1 | Cholinergic, muscarinic M1
Type:
Protein
Mol. Mass.:
51442.54
Organism:
Homo sapiens (Human)
Description:
P11229
Residue:
460
  
Inhibitor
Name:
BDBM50263413
Synonyms:
2-[4-(2-Oxo-2,3-dihydro-benzoimidazol-1-yl)-[1,4']bipiperidinyl-1'-ylmethyl]-benzonitrile | CHEMBL476990
Type:
Small organic molecule
Emp. Form.:
C25H29N5O
Mol. Mass.:
415.5307
SMILES:
O=c1[nH]c2ccccc2n1C1CCN(CC1)C1CCN(Cc2ccccc2C#N)CC1
: