Target
C5a anaphylatoxin chemotactic receptor 1
Ligand
BDBM50275571
Substrate
Meas. Tech.
ChEMBL_496808 (CHEMBL1008821)
IC50
>1000±n/a nM
Citation
 Blagg, JMowbray, CPryde, DCSalmon, GSchmid, EFairman, DBeaumont, K Small, non-peptide C5a receptor antagonists: part 1. Bioorg Med Chem Lett 18:5601-4 (2008)  
Target
Name:
C5a anaphylatoxin chemotactic receptor 1
Synonyms:
C5AR C5AR1_HUMAN C5a anaphylatoxin chemotactic receptor C5a-R | CD_antigen=CD88
Type:
Enzyme
Mol. Mass.:
39347.68
Organism:
Homo sapiens (Human)
Description:
P21730
Residue:
350
  
Inhibitor
Name:
BDBM50275571
Synonyms:
CHEMBL486970 | N-(4-chlorophenethyl)-N-(piperidin-4-yl)benzo[b]thiophene-3-carboxamide
Type:
Small organic molecule
Emp. Form.:
C22H23ClN2OS
Mol. Mass.:
398.949
SMILES:
Clc1ccc(CCN(C2CCNCC2)C(=O)c2csc3ccccc23)cc1
: