Target
C5a anaphylatoxin chemotactic receptor 1
Ligand
BDBM50275573
Substrate
Meas. Tech.
ChEMBL_496808 (CHEMBL1008821)
IC50
70±n/a nM
Citation
 Blagg, JMowbray, CPryde, DCSalmon, GSchmid, EFairman, DBeaumont, K Small, non-peptide C5a receptor antagonists: part 1. Bioorg Med Chem Lett 18:5601-4 (2008)  
Target
Name:
C5a anaphylatoxin chemotactic receptor 1
Synonyms:
C5AR C5AR1_HUMAN C5a anaphylatoxin chemotactic receptor C5a-R | CD_antigen=CD88
Type:
Enzyme
Mol. Mass.:
39347.68
Organism:
Homo sapiens (Human)
Description:
P21730
Residue:
350
  
Inhibitor
Name:
BDBM50275573
Synonyms:
CHEMBL487167 | trans-N-(4-chlorophenethyl)-N-4-hydroxycyclohexyl)benzo[b]thiophene-3-carboxamide
Type:
Small organic molecule
Emp. Form.:
C23H24ClNO2S
Mol. Mass.:
413.96
SMILES:
O[C@H]1CC[C@@H](CC1)N(CCc1ccc(Cl)cc1)C(=O)c1csc2ccccc12
: