Target
C5a anaphylatoxin chemotactic receptor 1
Ligand
BDBM50275833
Substrate
Meas. Tech.
ChEMBL_496808 (CHEMBL1008821)
IC50
395±n/a nM
Citation
 Blagg, JMowbray, CPryde, DCSalmon, GSchmid, EFairman, DBeaumont, K Small, non-peptide C5a receptor antagonists: part 1. Bioorg Med Chem Lett 18:5601-4 (2008)  
Target
Name:
C5a anaphylatoxin chemotactic receptor 1
Synonyms:
C5AR C5AR1_HUMAN C5a anaphylatoxin chemotactic receptor C5a-R | CD_antigen=CD88
Type:
Enzyme
Mol. Mass.:
39347.68
Organism:
Homo sapiens (Human)
Description:
P21730
Residue:
350
  
Inhibitor
Name:
BDBM50275833
Synonyms:
CHEMBL511613 | N-benzyl-N-(1,4-dioxaspiro[4.5]decan-8-yl)benzo[b]thiophene-3-carboxamide
Type:
Small organic molecule
Emp. Form.:
C24H25NO3S
Mol. Mass.:
407.525
SMILES:
O=C(N(Cc1ccccc1)C1CCC2(CC1)OCCO2)c1csc2ccccc12
: