Target
Chitin synthase 1
Ligand
BDBM50089541
Substrate
Meas. Tech.
ChEMBL_539532 (CHEMBL1032341)
IC50
0.200000±n/a nM
Citation
 Escalante, AGattuso, MPérez, PZacchino, S Evidence for the mechanism of action of the antifungal phytolaccoside B isolated from Phytolacca tetramera Hauman. J Nat Prod 71:1720-5 (2008)  
Target
Name:
Chitin synthase 1
Synonyms:
CHS1 | CHS1_YEAST
Type:
PROTEIN
Mol. Mass.:
129864.18
Organism:
Saccharomyces cerevisiae
Description:
ChEMBL_539532
Residue:
1131
  
Inhibitor
Name:
BDBM50089541
Synonyms:
(R)-[(S)-(2S,3S,4S)-2-Amino-4-hydroxy-4-(5-hydroxy-pyridin-2-yl)-3-methyl-butyrylamino]-[(3S,4R,5R)-5-(2,4-dioxo-3,4-dihydro-2H-pyrimidin-1-yl)-3,4-dihydroxy-tetrahydro-furan-2-yl]-acetic acid (S)-[(2R,3R,4R)-2-Amino-4-hydroxy-4-(5-hydroxy-pyridin-2-yl)-3-methyl-butyrylamino]-[(S)-5-(2,4-dioxo-3,4-dihydro-2H-pyrimidin-1-yl)-3,4-dihydroxy-tetrahydro-furan-2-yl]-acetic acid (S)-[(2S,3S,4S)-2-Amino-4-hydroxy-4-(5-hydroxy-pyridin-2-yl)-3-methyl-butyrylamino]-[5-(2,4-dioxo-3,4-dihydro-2H-pyrimidin-1-yl)-3,4-dihydroxy-tetrahydro-furan-2-yl]-acetic acid NIKKOMYCIN [(S)-2-Amino-4-hydroxy-4-((1S,2S)-5-hydroxy-pyridin-2-yl)-3-methyl-butyrylamino]-[5-(2,4-dioxo-3,4-dihydro-2H-pyrimidin-1-yl)-3,4-dihydroxy-tetrahydro-furan-2-yl]-acetic acid nikkomycin Z
Type:
Small organic molecule
Emp. Form.:
C20H25N5O10
Mol. Mass.:
495.44
SMILES:
C[C@@H]([C@H](N)C(=O)N[C@@H]([C@H]1O[C@H]([C@H](O)[C@@H]1O)n1ccc(=O)[nH]c1=O)C(O)=O)[C@H](O)c1ccc(O)cn1
: