Target
Acetylcholinesterase
Ligand
BDBM10625
Substrate
Meas. Tech.
ChEMBL_534770 (CHEMBL986294)
IC50
2500±n/a nM
Citation
 Carolan, CGDillon, GPGaynor, JMReidy, SRyder, SAKhan, DMarquez, JFGilmer, JF Isosorbide-2-carbamate esters: potent and selective butyrylcholinesterase inhibitors. J Med Chem 51:6400-9 (2008)  
Target
Name:
Acetylcholinesterase
Synonyms:
ACES_ELEEL Acetylcholinesterase (EeAChE) | ache
Type:
Enzyme
Mol. Mass.:
71812.79
Organism:
Electrophorus electricus (Electric eel)
Description:
Residue:
633
  
Inhibitor
Name:
BDBM10625
Synonyms:
({[bis(propan-2-ylamino)phosphoryl]oxy}(propan-2-ylamino)phosphoryl)(propan-2-yl)amine iso-OMPA | tetra(monoisopropyl)pyrophosphortetramide
Type:
Small organic molecule
Emp. Form.:
C12H32N4O3P2
Mol. Mass.:
342.355
SMILES:
CC(C)NP(=O)(NC(C)C)OP(=O)(NC(C)C)NC(C)C
: