Target
Bombesin receptor subtype-3
Ligand
BDBM50275902
Substrate
Meas. Tech.
ChEMBL_496868 (CHEMBL998537)
EC50
3.9±n/a nM
Citation
 Carlton, DLCollin-Smith, LJDaniels, AJDeaton, DNGoetz, ASLaudeman, CPLittleton, TRMusso, DLMorgan, RJSzewczyk, JRZhang, C Discovery of small molecule agonists for the bombesin receptor subtype 3 (BRS-3) based on an omeprazole lead. Bioorg Med Chem Lett 18:5451-5 (2008)  
Target
Name:
Bombesin receptor subtype-3
Synonyms:
BRS-3 BRS3_HUMAN Bombesin like receptor 3
Type:
Enzyme Catalytic Domain
Mol. Mass.:
44424.45
Organism:
Homo sapiens (Human)
Description:
Bombesin 3 BRS3 HUMAN::P32247
Residue:
399
  
Inhibitor
Name:
BDBM50275902
Synonyms:
CHEMBL525577 | D-Phe-Gln-Trp-Ala-Val-b-Ala-His-Phe-Nle-NH2
Type:
Small organic molecule
Emp. Form.:
C57H76N14O10
Mol. Mass.:
1117.3011
SMILES:
CCCC[C@H](NC(=O)[C@H](Cc1ccccc1)NC(=O)[C@H](Cc1cnc[nH]1)NC(=O)[C@@H](C)NC(=O)[C@@H](NC(=O)[C@H](C)NC(=O)[C@H](Cc1c[nH]c2ccccc12)NC(=O)[C@H](CCC(N)=O)NC(=O)[C@H](N)Cc1ccccc1)C(C)C)C(N)=O
: