Target
Carbonic anhydrase 1
Ligand
BDBM48319
Substrate
Meas. Tech.
ChEMBL_497169 (CHEMBL1002069)
IC50
130000±n/a nM
Citation
 Bayram, ESenturk, MKufrevioglu, OISupuran, CT In vitro inhibition of salicylic acid derivatives on human cytosolic carbonic anhydrase isozymes I and II. Bioorg Med Chem 16:9101-5 (2008)  
Target
Name:
Carbonic anhydrase 1
Synonyms:
CA-I CAB Carbonate dehydratase I Carbonic anhydrase 1 (CA I) Carbonic anhydrase 1 (Recombinant CA I) Carbonic anhydrase B Carbonic anhydrase I (CA I) Carbonic anhydrase I (CAI) Carbonic anhydrase isoenzyme I (hCA I) | hCA
Type:
Enzyme
Mol. Mass.:
28873.37
Organism:
Homo sapiens (Human)
Description:
P00915
Residue:
261
  
Inhibitor
Name:
BDBM48319
Synonyms:
4-amino-2-hydroxy-benzoic acid 4-azanyl-2-oxidanyl-benzoic acid ISONICOTINIC ACID HYDRAZIDE P-AMINOSALICYLATE SALT P-AMINOSALICYLIC ACID SMR000058830 | cid_11988145
Type:
Small organic molecule
Emp. Form.:
C7H7NO3
Mol. Mass.:
153.1354
SMILES:
Nc1ccc(C(O)=O)c(O)c1
: